We use cookies to give you the best experience on our website. If you continue to browse, then you agree to our privacy policy and cookie policy. (Last updated on: November 16, 2018).
Unfortunately, activation email could not send to your email. Please try again.
Syncfusion Feedback

Syncfusion for ASP.NET Core 1.0 Release?

Thread ID:

Created:

Updated:

Platform:

Replies:

125220 Jul 31,2016 02:33 PM UTC Aug 18,2016 09:22 AM UTC ASP.NET MVC 7
loading
Tags: General
Asaf Goldman
Asked On July 31, 2016 02:33 PM UTC

Hi,

When Syncfusion for ASP.NET Core 1.0 Release will be available as currently it is for ASP.NET Core 1.0 RC2?

Thanks,
AG 

sureshkumar.P [Syncfusion]
Replied On August 1, 2016 12:01 PM UTC

Hi Asaf Goldman, 
 
We are glad to announce that our Essential Studio 2016 Volume 2 Service Pack Release v14.2.0.28 is rolled out and is available for download under the following link. 
 
 
Also we have provided support for ASP.NET Core 1.0 Preview 2(with Visual Studio 2015 update3). 
 
We thank you for your support and appreciate your patience in waiting for this release. Please get in touch with us if you would require any further assistance. 
 
Regards, 
Sureshkumar P 


Sergey Seriakov
Replied On August 12, 2016 09:47 PM UTC

Hi Asaf Goldman, 
 
We are glad to announce that our Essential Studio 2016 Volume 2 Service Pack Release v14.2.0.28 is rolled out and is available for download under the following link. 
 
 
Also we have provided support for ASP.NET Core 1.0 Preview 2(with Visual Studio 2015 update3). 
 
We thank you for your support and appreciate your patience in waiting for this release. Please get in touch with us if you would require any further assistance. 
 
Regards, 
Sureshkumar P 


Hi guys.

That's really great work.

However, I've got that strange log error (below) when I tried to open SampleBrowser project (ASP NET Core) included in this release.
What could be done in order to solve this issue?

Thanks,
Srg

PATH=.\node_modules\.bin;C:\Program Files (x86)\Microsoft Visual Studio 14.0\Web\External;%PATH%;C:\Program Files (x86)\Microsoft Visual Studio 14.0\Web\External\git
C:\Program Files\dotnet\dotnet.exe restore "C:\Users\Sergey\AppData\Local\Syncfusion\EssentialStudio\14.2.0.28\MVC\ASP.NET Core Samples\Web\samplebrowser\.vs\restore.dg"
log  : Restoring packages for C:\Users\Sergey\AppData\Local\Syncfusion\EssentialStudio\14.2.0.28\MVC\ASP.NET Core Samples\Web\samplebrowser\project.json...
log  : Retrying 'FindPackagesByIdAsyncCore' for source 'http://nuget.syncfusion.com/aspnetmvc/FindPackagesById()?id='Microsoft.AspNetCore.Mvc.Core''.
log  : Response status code does not indicate success: 404 (Not Found).
log  : Retrying 'FindPackagesByIdAsyncCore' for source 'http://nuget.syncfusion.com/aspnetmvc/FindPackagesById()?id='System.Linq.Queryable''.
log  : Response status code does not indicate success: 404 (Not Found).
log  : Retrying 'FindPackagesByIdAsyncCore' for source 'http://nuget.syncfusion.com/aspnetmvc/FindPackagesById()?id='System.Collections.NonGeneric''.
log  : Response status code does not indicate success: 404 (Not Found).
log  : Retrying 'FindPackagesByIdAsyncCore' for source 'http://nuget.syncfusion.com/aspnetmvc/FindPackagesById()?id='System.Reflection.Emit''.
log  : Response status code does not indicate success: 404 (Not Found).
log  : Retrying 'FindPackagesByIdAsyncCore' for source 'http://nuget.syncfusion.com/aspnetmvc/FindPackagesById()?id='Microsoft.AspNetCore.Mvc.TagHelpers''.
log  : Response status code does not indicate success: 404 (Not Found).
log  : Retrying 'FindPackagesByIdAsyncCore' for source 'http://nuget.syncfusion.com/aspnetmvc/FindPackagesById()?id='System.Data.Common''.
log  : Response status code does not indicate success: 404 (Not Found).
log  : Retrying 'FindPackagesByIdAsyncCore' for source 'http://nuget.syncfusion.com/aspnetmvc/FindPackagesById()?id='System.Collections''.
log  : Response status code does not indicate success: 404 (Not Found).
log  : Retrying 'FindPackagesByIdAsyncCore' for source 'http://nuget.syncfusion.com/aspnetmvc/FindPackagesById()?id='Microsoft.AspNetCore.Hosting''.
log  : Response status code does not indicate success: 404 (Not Found).
log  : Retrying 'FindPackagesByIdAsyncCore' for source 'http://nuget.syncfusion.com/aspnetmvc/FindPackagesById()?id='System.Linq''.
log  : Response status code does not indicate success: 404 (Not Found).
log  : Retrying 'FindPackagesByIdAsyncCore' for source 'http://nuget.syncfusion.com/aspnetmvc/FindPackagesById()?id='Newtonsoft.Json''.
log  : Response status code does not indicate success: 404 (Not Found).
log  : Retrying 'FindPackagesByIdAsyncCore' for source 'http://nuget.syncfusion.com/aspnetmvc/FindPackagesById()?id='System.Linq.Queryable''.
log  : Response status code does not indicate success: 404 (Not Found).
log  : Retrying 'FindPackagesByIdAsyncCore' for source 'http://nuget.syncfusion.com/aspnetmvc/FindPackagesById()?id='Microsoft.AspNetCore.Mvc.Core''.
log  : Response status code does not indicate success: 404 (Not Found).
log  : Retrying 'FindPackagesByIdAsyncCore' for source 'http://nuget.syncfusion.com/aspnetmvc/FindPackagesById()?id='System.Reflection.Emit''.
log  : Response status code does not indicate success: 404 (Not Found).
log  : Retrying 'FindPackagesByIdAsyncCore' for source 'http://nuget.syncfusion.com/aspnetmvc/FindPackagesById()?id='System.Collections.NonGeneric''.
log  : Response status code does not indicate success: 404 (Not Found).
log  : Retrying 'FindPackagesByIdAsyncCore' for source 'http://nuget.syncfusion.com/aspnetmvc/FindPackagesById()?id='Newtonsoft.Json''.
log  : Response status code does not indicate success: 404 (Not Found).
log  : Retrying 'FindPackagesByIdAsyncCore' for source 'http://nuget.syncfusion.com/aspnetmvc/FindPackagesById()?id='Microsoft.AspNetCore.Mvc.TagHelpers''.
log  : Response status code does not indicate success: 404 (Not Found).
log  : Retrying 'FindPackagesByIdAsyncCore' for source 'http://nuget.syncfusion.com/aspnetmvc/FindPackagesById()?id='System.Linq''.
log  : Response status code does not indicate success: 404 (Not Found).
log  : Retrying 'FindPackagesByIdAsyncCore' for source 'http://nuget.syncfusion.com/aspnetmvc/FindPackagesById()?id='System.Data.Common''.
log  : Response status code does not indicate success: 404 (Not Found).
log  : Retrying 'FindPackagesByIdAsyncCore' for source 'http://nuget.syncfusion.com/aspnetmvc/FindPackagesById()?id='System.Collections''.
log  : Response status code does not indicate success: 404 (Not Found).
log  : Retrying 'FindPackagesByIdAsyncCore' for source 'http://nuget.syncfusion.com/aspnetmvc/FindPackagesById()?id='Microsoft.AspNetCore.Hosting''.
log  : Response status code does not indicate success: 404 (Not Found).
error: Failed to retrieve information from remote source 'http://nuget.syncfusion.com/aspnetmvc/FindPackagesById()?id='System.Collections.NonGeneric''.
error: Response status code does not indicate success: 404 (Not Found).
error: Failed to retrieve information from remote source 'http://nuget.syncfusion.com/aspnetmvc/FindPackagesById()?id='System.Collections.NonGeneric''.
error:   Response status code does not indicate success: 404 (Not Found).
error: Failed to retrieve information from remote source 'http://nuget.syncfusion.com/aspnetmvc/FindPackagesById()?id='System.Reflection.Emit''.
error: Response status code does not indicate success: 404 (Not Found).
error: Failed to retrieve information from remote source 'http://nuget.syncfusion.com/aspnetmvc/FindPackagesById()?id='Microsoft.AspNetCore.Mvc.Core''.
error: Response status code does not indicate success: 404 (Not Found).
error: Failed to retrieve information from remote source 'http://nuget.syncfusion.com/aspnetmvc/FindPackagesById()?id='System.Linq.Queryable''.
error: Response status code does not indicate success: 404 (Not Found).
error: Failed to retrieve information from remote source 'http://nuget.syncfusion.com/aspnetmvc/FindPackagesById()?id='Newtonsoft.Json''.
error: Response status code does not indicate success: 404 (Not Found).
error: Failed to retrieve information from remote source 'http://nuget.syncfusion.com/aspnetmvc/FindPackagesById()?id='Microsoft.AspNetCore.Mvc.TagHelpers''.
error: Response status code does not indicate success: 404 (Not Found).
error: Failed to retrieve information from remote source 'http://nuget.syncfusion.com/aspnetmvc/FindPackagesById()?id='Microsoft.AspNetCore.Hosting''.
error: Response status code does not indicate success: 404 (Not Found).
error: Failed to retrieve information from remote source 'http://nuget.syncfusion.com/aspnetmvc/FindPackagesById()?id='System.Collections''.
error: Response status code does not indicate success: 404 (Not Found).
error: Failed to retrieve information from remote source 'http://nuget.syncfusion.com/aspnetmvc/FindPackagesById()?id='System.Linq''.
error: Response status code does not indicate success: 404 (Not Found).
error: Failed to retrieve information from remote source 'http://nuget.syncfusion.com/aspnetmvc/FindPackagesById()?id='System.Data.Common''.
error: Response status code does not indicate success: 404 (Not Found).



Francis Paul Antony Raj [Syncfusion]
Replied On August 15, 2016 06:36 AM UTC

Hi Asaf, 
 
Thanks for your update. 
 
We would like to let you know that, the following software are need to be installed on your machine for working with ASP.NET Core 1.0. 
1)      Visual Studio 2015 Update 3 
2)      DotNetCore 1.0.0 (Preview 2) 
 
Please install the above software and run our ASP.NET Core Samples from the Essential Studio dashboard. 
To get started with ASP.NET Core Samples, please refer to http://help.syncfusion.com/aspnetmvc/getting-started#aspnet-core-10-application 
 
If still you face any issue when compiling the project, please share the output window result. This will be helpful for us to analyze and provide the solution at the earliest. 
 
Regards, 
Francis Paul A 


Sergey Seriakov
Replied On August 15, 2016 09:19 AM UTC

Hi Asaf, 
 
Thanks for your update. 
 
We would like to let you know that, the following software are need to be installed on your machine for working with ASP.NET Core 1.0. 
1)      Visual Studio 2015 Update 3 
2)      DotNetCore 1.0.0 (Preview 2) 
 
Please install the above software and run our ASP.NET Core Samples from the Essential Studio dashboard. 
To get started with ASP.NET Core Samples, please refer to http://help.syncfusion.com/aspnetmvc/getting-started#aspnet-core-10-application 
 
If still you face any issue when compiling the project, please share the output window result. This will be helpful for us to analyze and provide the solution at the earliest. 
 
Regards, 
Francis Paul A 


Hi guys, thanks for your response.

Guys, I'm still facing that issue. You know I've already had required components and modules you could see on my screenshot below and all I'm doing just opening you exact sample project named "samplebrowser" from your distributed package version 14.2.0.28 to build it then I've got messages represented by Output Window:

1>------ Build started: Project: samplebrowser, Configuration: Debug Any CPU ------
1> C:\Program Files\dotnet\dotnet.exe build "C:\Users\Sergey\AppData\Local\Syncfusion\EssentialStudio\14.2.0.28\MVC\ASP.NET Core Samples\Web\samplebrowser" --configuration Debug --no-dependencies
1> Project samplebrowser (.NETCoreApp,Version=v1.0) will be compiled because expected outputs are missing
1> Compiling samplebrowser for .NETCoreApp,Version=v1.0
1>C:\Users\Sergey\AppData\Local\Syncfusion\EssentialStudio\14.2.0.28\MVC\ASP.NET Core Samples\Web\samplebrowser\project.json(7,58): error NU1001: The dependency Microsoft.AspNetCore.Authentication >= 1.0.0 could not be resolved.
1>C:\Users\Sergey\AppData\Local\Syncfusion\EssentialStudio\14.2.0.28\MVC\ASP.NET Core Samples\Web\samplebrowser\project.json(10,64): error NU1001: The dependency Microsoft.AspNetCore.Authentication >= 1.0.0 could not be resolved.
1>C:\Users\Sergey\AppData\Local\Syncfusion\EssentialStudio\14.2.0.28\MVC\ASP.NET Core Samples\Web\samplebrowser\project.json(7,58): error NU1001: The dependency Microsoft.AspNetCore.Authentication.Cookies >= 1.0.0 could not be resolved.
1>C:\Users\Sergey\AppData\Local\Syncfusion\EssentialStudio\14.2.0.28\MVC\ASP.NET Core Samples\Web\samplebrowser\project.json(10,64): error NU1001: The dependency Microsoft.AspNetCore.Authentication.Cookies >= 1.0.0 could not be resolved.
1>C:\Users\Sergey\AppData\Local\Syncfusion\EssentialStudio\14.2.0.28\MVC\ASP.NET Core Samples\Web\samplebrowser\project.json(7,58): error NU1001: The dependency Microsoft.AspNetCore.Authentication.Cookies >= 1.0.0 could not be resolved.
1>C:\Users\Sergey\AppData\Local\Syncfusion\EssentialStudio\14.2.0.28\MVC\ASP.NET Core Samples\Web\samplebrowser\project.json(10,64): error NU1001: The dependency Microsoft.AspNetCore.Authentication.Cookies >= 1.0.0 could not be resolved.
1>C:\Users\Sergey\AppData\Local\Syncfusion\EssentialStudio\14.2.0.28\MVC\ASP.NET Core Samples\Web\samplebrowser\project.json(10,64): error NU1001: The dependency Microsoft.AspNetCore.Cryptography.KeyDerivation >= 1.0.0 could not be resolved.
1>C:\Users\Sergey\AppData\Local\Syncfusion\EssentialStudio\14.2.0.28\MVC\ASP.NET Core Samples\Web\samplebrowser\project.json(9,67): error NU1001: The dependency Microsoft.AspNetCore.Diagnostics.EntityFrameworkCore >= 1.0.0 could not be resolved.
1>C:\Users\Sergey\AppData\Local\Syncfusion\EssentialStudio\14.2.0.28\MVC\ASP.NET Core Samples\Web\samplebrowser\project.json(10,64): error NU1001: The dependency Microsoft.AspNetCore.Identity >= 1.0.0 could not be resolved.
1>C:\Users\Sergey\AppData\Local\Syncfusion\EssentialStudio\14.2.0.28\MVC\ASP.NET Core Samples\Web\samplebrowser\project.json(10,64): error NU1001: The dependency Microsoft.AspNetCore.Identity.EntityFrameworkCore >= 1.0.0 could not be resolved.
1>C:\Users\Sergey\AppData\Local\Syncfusion\EssentialStudio\14.2.0.28\MVC\ASP.NET Core Samples\Web\samplebrowser\project.json(40,43): error NU1001: The dependency Microsoft.AspNetCore.Session >= 1.0.0 could not be resolved.
1>C:\Users\Sergey\AppData\Local\Syncfusion\EssentialStudio\14.2.0.28\MVC\ASP.NET Core Samples\Web\samplebrowser\project.json(32,56): error NU1001: The dependency Microsoft.CodeAnalysis.CSharp.Workspaces >= 1.3.0 could not be resolved.
1>C:\Users\Sergey\AppData\Local\Syncfusion\EssentialStudio\14.2.0.28\MVC\ASP.NET Core Samples\Web\samplebrowser\project.json(36,54): error NU1001: The dependency Microsoft.CodeAnalysis.CSharp.Workspaces >= 1.3.0 could not be resolved.
1>C:\Users\Sergey\AppData\Local\Syncfusion\EssentialStudio\14.2.0.28\MVC\ASP.NET Core Samples\Web\samplebrowser\project.json(32,56): error NU1001: The dependency Microsoft.CodeAnalysis.Workspaces.Common 1.3.0 could not be resolved.
1>C:\Users\Sergey\AppData\Local\Syncfusion\EssentialStudio\14.2.0.28\MVC\ASP.NET Core Samples\Web\samplebrowser\project.json(36,54): error NU1001: The dependency Microsoft.CodeAnalysis.Workspaces.Common 1.3.0 could not be resolved.
1>C:\Users\Sergey\AppData\Local\Syncfusion\EssentialStudio\14.2.0.28\MVC\ASP.NET Core Samples\Web\samplebrowser\project.json(32,56): error NU1001: The dependency Microsoft.Composition >= 1.0.27 could not be resolved.
1>C:\Users\Sergey\AppData\Local\Syncfusion\EssentialStudio\14.2.0.28\MVC\ASP.NET Core Samples\Web\samplebrowser\project.json(36,54): error NU1001: The dependency Microsoft.Composition >= 1.0.27 could not be resolved.
1>C:\Users\Sergey\AppData\Local\Syncfusion\EssentialStudio\14.2.0.28\MVC\ASP.NET Core Samples\Web\samplebrowser\project.json(9,67): error NU1001: The dependency Microsoft.EntityFrameworkCore >= 1.0.0 could not be resolved.
1>C:\Users\Sergey\AppData\Local\Syncfusion\EssentialStudio\14.2.0.28\MVC\ASP.NET Core Samples\Web\samplebrowser\project.json(10,64): error NU1001: The dependency Microsoft.EntityFrameworkCore >= 1.0.0 could not be resolved.
1>C:\Users\Sergey\AppData\Local\Syncfusion\EssentialStudio\14.2.0.28\MVC\ASP.NET Core Samples\Web\samplebrowser\project.json(21,44): error NU1001: The dependency Microsoft.EntityFrameworkCore >= 1.0.0 could not be resolved.
1>C:\Users\Sergey\AppData\Local\Syncfusion\EssentialStudio\14.2.0.28\MVC\ASP.NET Core Samples\Web\samplebrowser\project.json(19,54): error NU1001: The dependency Microsoft.EntityFrameworkCore >= 1.0.0 could not be resolved.
1>C:\Users\Sergey\AppData\Local\Syncfusion\EssentialStudio\14.2.0.28\MVC\ASP.NET Core Samples\Web\samplebrowser\project.json(32,56): error NU1001: The dependency Microsoft.EntityFrameworkCore >= 1.0.0 could not be resolved.
1>C:\Users\Sergey\AppData\Local\Syncfusion\EssentialStudio\14.2.0.28\MVC\ASP.NET Core Samples\Web\samplebrowser\project.json(36,54): error NU1001: The dependency Microsoft.EntityFrameworkCore >= 1.0.0 could not be resolved.
1>C:\Users\Sergey\AppData\Local\Syncfusion\EssentialStudio\14.2.0.28\MVC\ASP.NET Core Samples\Web\samplebrowser\project.json(21,44): error NU1001: The dependency Microsoft.EntityFrameworkCore.Design >= 1.0.0-preview2-final could not be resolved.
1>C:\Users\Sergey\AppData\Local\Syncfusion\EssentialStudio\14.2.0.28\MVC\ASP.NET Core Samples\Web\samplebrowser\project.json(21,44): error NU1001: The dependency Microsoft.EntityFrameworkCore.Design.Core >= 1.0.0-preview2-final could not be resolved.
1>C:\Users\Sergey\AppData\Local\Syncfusion\EssentialStudio\14.2.0.28\MVC\ASP.NET Core Samples\Web\samplebrowser\project.json(9,67): error NU1001: The dependency Microsoft.EntityFrameworkCore.Relational >= 1.0.0 could not be resolved.
1>C:\Users\Sergey\AppData\Local\Syncfusion\EssentialStudio\14.2.0.28\MVC\ASP.NET Core Samples\Web\samplebrowser\project.json(10,64): error NU1001: The dependency Microsoft.EntityFrameworkCore.Relational >= 1.0.0 could not be resolved.
1>C:\Users\Sergey\AppData\Local\Syncfusion\EssentialStudio\14.2.0.28\MVC\ASP.NET Core Samples\Web\samplebrowser\project.json(21,44): error NU1001: The dependency Microsoft.EntityFrameworkCore.Relational >= 1.0.0 could not be resolved.
1>C:\Users\Sergey\AppData\Local\Syncfusion\EssentialStudio\14.2.0.28\MVC\ASP.NET Core Samples\Web\samplebrowser\project.json(19,54): error NU1001: The dependency Microsoft.EntityFrameworkCore.Relational >= 1.0.0 could not be resolved.
1>C:\Users\Sergey\AppData\Local\Syncfusion\EssentialStudio\14.2.0.28\MVC\ASP.NET Core Samples\Web\samplebrowser\project.json(32,56): error NU1001: The dependency Microsoft.EntityFrameworkCore.Relational >= 1.0.0 could not be resolved.
1>C:\Users\Sergey\AppData\Local\Syncfusion\EssentialStudio\14.2.0.28\MVC\ASP.NET Core Samples\Web\samplebrowser\project.json(36,54): error NU1001: The dependency Microsoft.EntityFrameworkCore.Relational >= 1.0.0 could not be resolved.
1>C:\Users\Sergey\AppData\Local\Syncfusion\EssentialStudio\14.2.0.28\MVC\ASP.NET Core Samples\Web\samplebrowser\project.json(21,44): error NU1001: The dependency Microsoft.EntityFrameworkCore.Relational.Design >= 1.0.0 could not be resolved.
1>C:\Users\Sergey\AppData\Local\Syncfusion\EssentialStudio\14.2.0.28\MVC\ASP.NET Core Samples\Web\samplebrowser\project.json(19,54): error NU1001: The dependency Microsoft.EntityFrameworkCore.SqlServer >= 1.0.0 could not be resolved.
1>C:\Users\Sergey\AppData\Local\Syncfusion\EssentialStudio\14.2.0.28\MVC\ASP.NET Core Samples\Web\samplebrowser\project.json(32,56): error NU1001: The dependency Microsoft.EntityFrameworkCore.SqlServer >= 1.0.0 could not be resolved.
1>C:\Users\Sergey\AppData\Local\Syncfusion\EssentialStudio\14.2.0.28\MVC\ASP.NET Core Samples\Web\samplebrowser\project.json(36,54): error NU1001: The dependency Microsoft.EntityFrameworkCore.SqlServer >= 1.0.0 could not be resolved.
1>C:\Users\Sergey\AppData\Local\Syncfusion\EssentialStudio\14.2.0.28\MVC\ASP.NET Core Samples\Web\samplebrowser\project.json(19,54): error NU1001: The dependency Microsoft.EntityFrameworkCore.SqlServer >= 1.0.0 could not be resolved.
1>C:\Users\Sergey\AppData\Local\Syncfusion\EssentialStudio\14.2.0.28\MVC\ASP.NET Core Samples\Web\samplebrowser\project.json(32,56): error NU1001: The dependency Microsoft.EntityFrameworkCore.SqlServer >= 1.0.0 could not be resolved.
1>C:\Users\Sergey\AppData\Local\Syncfusion\EssentialStudio\14.2.0.28\MVC\ASP.NET Core Samples\Web\samplebrowser\project.json(36,54): error NU1001: The dependency Microsoft.EntityFrameworkCore.SqlServer >= 1.0.0 could not be resolved.
1>C:\Users\Sergey\AppData\Local\Syncfusion\EssentialStudio\14.2.0.28\MVC\ASP.NET Core Samples\Web\samplebrowser\project.json(21,44): error NU1001: The dependency Microsoft.EntityFrameworkCore.Tools >= 1.0.0-preview2-final could not be resolved.
1>C:\Users\Sergey\AppData\Local\Syncfusion\EssentialStudio\14.2.0.28\MVC\ASP.NET Core Samples\Web\samplebrowser\project.json(27,61): error NU1001: The dependency Microsoft.Extensions.Configuration.UserSecrets >= 1.0.0 could not be resolved.
1>C:\Users\Sergey\AppData\Local\Syncfusion\EssentialStudio\14.2.0.28\MVC\ASP.NET Core Samples\Web\samplebrowser\project.json(32,56): error NU1001: The dependency Microsoft.VisualStudio.Web.CodeGeneration >= 1.0.0-preview2-final could not be resolved.
1>C:\Users\Sergey\AppData\Local\Syncfusion\EssentialStudio\14.2.0.28\MVC\ASP.NET Core Samples\Web\samplebrowser\project.json(36,54): error NU1001: The dependency Microsoft.VisualStudio.Web.CodeGeneration >= 1.0.0-preview2-final could not be resolved.
1>C:\Users\Sergey\AppData\Local\Syncfusion\EssentialStudio\14.2.0.28\MVC\ASP.NET Core Samples\Web\samplebrowser\project.json(32,56): error NU1001: The dependency Microsoft.VisualStudio.Web.CodeGeneration.Core >= 1.0.0-preview2-final could not be resolved.
1>C:\Users\Sergey\AppData\Local\Syncfusion\EssentialStudio\14.2.0.28\MVC\ASP.NET Core Samples\Web\samplebrowser\project.json(36,54): error NU1001: The dependency Microsoft.VisualStudio.Web.CodeGeneration.Core >= 1.0.0-preview2-final could not be resolved.
1>C:\Users\Sergey\AppData\Local\Syncfusion\EssentialStudio\14.2.0.28\MVC\ASP.NET Core Samples\Web\samplebrowser\project.json(32,56): error NU1001: The dependency Microsoft.VisualStudio.Web.CodeGeneration.EntityFrameworkCore >= 1.0.0-preview2-final could not be resolved.
1>C:\Users\Sergey\AppData\Local\Syncfusion\EssentialStudio\14.2.0.28\MVC\ASP.NET Core Samples\Web\samplebrowser\project.json(36,54): error NU1001: The dependency Microsoft.VisualStudio.Web.CodeGeneration.EntityFrameworkCore >= 1.0.0-preview2-final could not be resolved.
1>C:\Users\Sergey\AppData\Local\Syncfusion\EssentialStudio\14.2.0.28\MVC\ASP.NET Core Samples\Web\samplebrowser\project.json(32,56): error NU1001: The dependency Microsoft.VisualStudio.Web.CodeGeneration.Templating >= 1.0.0-preview2-final could not be resolved.
1>C:\Users\Sergey\AppData\Local\Syncfusion\EssentialStudio\14.2.0.28\MVC\ASP.NET Core Samples\Web\samplebrowser\project.json(36,54): error NU1001: The dependency Microsoft.VisualStudio.Web.CodeGeneration.Templating >= 1.0.0-preview2-final could not be resolved.
1>C:\Users\Sergey\AppData\Local\Syncfusion\EssentialStudio\14.2.0.28\MVC\ASP.NET Core Samples\Web\samplebrowser\project.json(32,56): error NU1001: The dependency Microsoft.VisualStudio.Web.CodeGeneration.Tools >= 1.0.0-preview2-final could not be resolved.
1>C:\Users\Sergey\AppData\Local\Syncfusion\EssentialStudio\14.2.0.28\MVC\ASP.NET Core Samples\Web\samplebrowser\project.json(32,56): error NU1001: The dependency Microsoft.VisualStudio.Web.CodeGeneration.Utils >= 1.0.0-preview2-final could not be resolved.
1>C:\Users\Sergey\AppData\Local\Syncfusion\EssentialStudio\14.2.0.28\MVC\ASP.NET Core Samples\Web\samplebrowser\project.json(36,54): error NU1001: The dependency Microsoft.VisualStudio.Web.CodeGeneration.Utils >= 1.0.0-preview2-final could not be resolved.
1>C:\Users\Sergey\AppData\Local\Syncfusion\EssentialStudio\14.2.0.28\MVC\ASP.NET Core Samples\Web\samplebrowser\project.json(36,54): error NU1001: The dependency Microsoft.VisualStudio.Web.CodeGenerators.Mvc >= 1.0.0-preview2-final could not be resolved.
1>C:\Users\Sergey\AppData\Local\Syncfusion\EssentialStudio\14.2.0.28\MVC\ASP.NET Core Samples\Web\samplebrowser\project.json(9,67): error NU1001: The dependency Remotion.Linq >= 2.1.1 could not be resolved.
1>C:\Users\Sergey\AppData\Local\Syncfusion\EssentialStudio\14.2.0.28\MVC\ASP.NET Core Samples\Web\samplebrowser\project.json(10,64): error NU1001: The dependency Remotion.Linq >= 2.1.1 could not be resolved.
1>C:\Users\Sergey\AppData\Local\Syncfusion\EssentialStudio\14.2.0.28\MVC\ASP.NET Core Samples\Web\samplebrowser\project.json(21,44): error NU1001: The dependency Remotion.Linq >= 2.1.1 could not be resolved.
1>C:\Users\Sergey\AppData\Local\Syncfusion\EssentialStudio\14.2.0.28\MVC\ASP.NET Core Samples\Web\samplebrowser\project.json(19,54): error NU1001: The dependency Remotion.Linq >= 2.1.1 could not be resolved.
1>C:\Users\Sergey\AppData\Local\Syncfusion\EssentialStudio\14.2.0.28\MVC\ASP.NET Core Samples\Web\samplebrowser\project.json(32,56): error NU1001: The dependency Remotion.Linq >= 2.1.1 could not be resolved.
1>C:\Users\Sergey\AppData\Local\Syncfusion\EssentialStudio\14.2.0.28\MVC\ASP.NET Core Samples\Web\samplebrowser\project.json(36,54): error NU1001: The dependency Remotion.Linq >= 2.1.1 could not be resolved.
1>C:\Users\Sergey\AppData\Local\Syncfusion\EssentialStudio\14.2.0.28\MVC\ASP.NET Core Samples\Web\samplebrowser\project.json(19,54): error NU1001: The dependency runtime.native.System.Data.SqlClient.sni >= 4.0.0 could not be resolved.
1>C:\Users\Sergey\AppData\Local\Syncfusion\EssentialStudio\14.2.0.28\MVC\ASP.NET Core Samples\Web\samplebrowser\project.json(32,56): error NU1001: The dependency runtime.native.System.Data.SqlClient.sni >= 4.0.0 could not be resolved.
1>C:\Users\Sergey\AppData\Local\Syncfusion\EssentialStudio\14.2.0.28\MVC\ASP.NET Core Samples\Web\samplebrowser\project.json(36,54): error NU1001: The dependency runtime.native.System.Data.SqlClient.sni >= 4.0.0 could not be resolved.
1>C:\Users\Sergey\AppData\Local\Syncfusion\EssentialStudio\14.2.0.28\MVC\ASP.NET Core Samples\Web\samplebrowser\project.json(19,54): error NU1001: The dependency runtime.win7-x64.runtime.native.System.Data.SqlClient.sni >= 4.0.1 could not be resolved.
1>C:\Users\Sergey\AppData\Local\Syncfusion\EssentialStudio\14.2.0.28\MVC\ASP.NET Core Samples\Web\samplebrowser\project.json(32,56): error NU1001: The dependency runtime.win7-x64.runtime.native.System.Data.SqlClient.sni >= 4.0.1 could not be resolved.
1>C:\Users\Sergey\AppData\Local\Syncfusion\EssentialStudio\14.2.0.28\MVC\ASP.NET Core Samples\Web\samplebrowser\project.json(36,54): error NU1001: The dependency runtime.win7-x64.runtime.native.System.Data.SqlClient.sni >= 4.0.1 could not be resolved.
1>C:\Users\Sergey\AppData\Local\Syncfusion\EssentialStudio\14.2.0.28\MVC\ASP.NET Core Samples\Web\samplebrowser\project.json(19,54): error NU1001: The dependency runtime.win7-x86.runtime.native.System.Data.SqlClient.sni >= 4.0.1 could not be resolved.
1>C:\Users\Sergey\AppData\Local\Syncfusion\EssentialStudio\14.2.0.28\MVC\ASP.NET Core Samples\Web\samplebrowser\project.json(32,56): error NU1001: The dependency runtime.win7-x86.runtime.native.System.Data.SqlClient.sni >= 4.0.1 could not be resolved.
1>C:\Users\Sergey\AppData\Local\Syncfusion\EssentialStudio\14.2.0.28\MVC\ASP.NET Core Samples\Web\samplebrowser\project.json(36,54): error NU1001: The dependency runtime.win7-x86.runtime.native.System.Data.SqlClient.sni >= 4.0.1 could not be resolved.
1>C:\Users\Sergey\AppData\Local\Syncfusion\EssentialStudio\14.2.0.28\MVC\ASP.NET Core Samples\Web\samplebrowser\project.json(21,44): error NU1001: The dependency System.Collections.NonGeneric >= 4.0.1 could not be resolved.
1>C:\Users\Sergey\AppData\Local\Syncfusion\EssentialStudio\14.2.0.28\MVC\ASP.NET Core Samples\Web\samplebrowser\project.json(43,63): error NU1001: The dependency System.Collections.NonGeneric >= 4.0.1 could not be resolved.
1>C:\Users\Sergey\AppData\Local\Syncfusion\EssentialStudio\14.2.0.28\MVC\ASP.NET Core Samples\Web\samplebrowser\project.json(48,57): error NU1001: The dependency System.Collections.NonGeneric >= 4.0.1 could not be resolved.
1>C:\Users\Sergey\AppData\Local\Syncfusion\EssentialStudio\14.2.0.28\MVC\ASP.NET Core Samples\Web\samplebrowser\project.json(50,54): error NU1001: The dependency System.Collections.NonGeneric >= 4.0.1 could not be resolved.
1>C:\Users\Sergey\AppData\Local\Syncfusion\EssentialStudio\14.2.0.28\MVC\ASP.NET Core Samples\Web\samplebrowser\project.json(46,63): error NU1001: The dependency System.Collections.NonGeneric >= 4.0.1 could not be resolved.
1>C:\Users\Sergey\AppData\Local\Syncfusion\EssentialStudio\14.2.0.28\MVC\ASP.NET Core Samples\Web\samplebrowser\project.json(47,64): error NU1001: The dependency System.Collections.NonGeneric >= 4.0.1 could not be resolved.
1>C:\Users\Sergey\AppData\Local\Syncfusion\EssentialStudio\14.2.0.28\MVC\ASP.NET Core Samples\Web\samplebrowser\project.json(45,55): error NU1001: The dependency System.Collections.NonGeneric >= 4.0.1 could not be resolved.
1>C:\Users\Sergey\AppData\Local\Syncfusion\EssentialStudio\14.2.0.28\MVC\ASP.NET Core Samples\Web\samplebrowser\project.json(49,57): error NU1001: The dependency System.Collections.NonGeneric >= 4.0.1 could not be resolved.
1>C:\Users\Sergey\AppData\Local\Syncfusion\EssentialStudio\14.2.0.28\MVC\ASP.NET Core Samples\Web\samplebrowser\project.json(41,50): error NU1001: The dependency System.Collections.NonGeneric >= 4.0.1 could not be resolved.
1>C:\Users\Sergey\AppData\Local\Syncfusion\EssentialStudio\14.2.0.28\MVC\ASP.NET Core Samples\Web\samplebrowser\project.json(42,54): error NU1001: The dependency System.Collections.NonGeneric >= 4.0.1 could not be resolved.
1>C:\Users\Sergey\AppData\Local\Syncfusion\EssentialStudio\14.2.0.28\MVC\ASP.NET Core Samples\Web\samplebrowser\project.json(10,64): error NU1001: The dependency System.Collections.NonGeneric >= 4.0.1 could not be resolved.
1>C:\Users\Sergey\AppData\Local\Syncfusion\EssentialStudio\14.2.0.28\MVC\ASP.NET Core Samples\Web\samplebrowser\project.json(11,39): error NU1001: The dependency System.Collections.NonGeneric >= 4.0.1 could not be resolved.
1>C:\Users\Sergey\AppData\Local\Syncfusion\EssentialStudio\14.2.0.28\MVC\ASP.NET Core Samples\Web\samplebrowser\project.json(44,57): error NU1001: The dependency System.Collections.NonGeneric >= 4.0.1 could not be resolved.
1>C:\Users\Sergey\AppData\Local\Syncfusion\EssentialStudio\14.2.0.28\MVC\ASP.NET Core Samples\Web\samplebrowser\project.json(21,44): error NU1001: The dependency System.Collections.NonGeneric >= 4.0.1-rc2-24027 could not be resolved.
1>C:\Users\Sergey\AppData\Local\Syncfusion\EssentialStudio\14.2.0.28\MVC\ASP.NET Core Samples\Web\samplebrowser\project.json(43,63): error NU1001: The dependency System.Collections.NonGeneric >= 4.0.1-rc2-24027 could not be resolved.
1>C:\Users\Sergey\AppData\Local\Syncfusion\EssentialStudio\14.2.0.28\MVC\ASP.NET Core Samples\Web\samplebrowser\project.json(48,57): error NU1001: The dependency System.Collections.NonGeneric >= 4.0.1-rc2-24027 could not be resolved.
1>C:\Users\Sergey\AppData\Local\Syncfusion\EssentialStudio\14.2.0.28\MVC\ASP.NET Core Samples\Web\samplebrowser\project.json(50,54): error NU1001: The dependency System.Collections.NonGeneric >= 4.0.1-rc2-24027 could not be resolved.
1>C:\Users\Sergey\AppData\Local\Syncfusion\EssentialStudio\14.2.0.28\MVC\ASP.NET Core Samples\Web\samplebrowser\project.json(46,63): error NU1001: The dependency System.Collections.NonGeneric >= 4.0.1-rc2-24027 could not be resolved.
1>C:\Users\Sergey\AppData\Local\Syncfusion\EssentialStudio\14.2.0.28\MVC\ASP.NET Core Samples\Web\samplebrowser\project.json(47,64): error NU1001: The dependency System.Collections.NonGeneric >= 4.0.1-rc2-24027 could not be resolved.
1>C:\Users\Sergey\AppData\Local\Syncfusion\EssentialStudio\14.2.0.28\MVC\ASP.NET Core Samples\Web\samplebrowser\project.json(45,55): error NU1001: The dependency System.Collections.NonGeneric >= 4.0.1-rc2-24027 could not be resolved.
1>C:\Users\Sergey\AppData\Local\Syncfusion\EssentialStudio\14.2.0.28\MVC\ASP.NET Core Samples\Web\samplebrowser\project.json(49,57): error NU1001: The dependency System.Collections.NonGeneric >= 4.0.1-rc2-24027 could not be resolved.
1>C:\Users\Sergey\AppData\Local\Syncfusion\EssentialStudio\14.2.0.28\MVC\ASP.NET Core Samples\Web\samplebrowser\project.json(41,50): error NU1001: The dependency System.Collections.NonGeneric >= 4.0.1-rc2-24027 could not be resolved.
1>C:\Users\Sergey\AppData\Local\Syncfusion\EssentialStudio\14.2.0.28\MVC\ASP.NET Core Samples\Web\samplebrowser\project.json(42,54): error NU1001: The dependency System.Collections.NonGeneric >= 4.0.1-rc2-24027 could not be resolved.
1>C:\Users\Sergey\AppData\Local\Syncfusion\EssentialStudio\14.2.0.28\MVC\ASP.NET Core Samples\Web\samplebrowser\project.json(10,64): error NU1001: The dependency System.Collections.NonGeneric >= 4.0.1-rc2-24027 could not be resolved.
1>C:\Users\Sergey\AppData\Local\Syncfusion\EssentialStudio\14.2.0.28\MVC\ASP.NET Core Samples\Web\samplebrowser\project.json(11,39): error NU1001: The dependency System.Collections.NonGeneric >= 4.0.1-rc2-24027 could not be resolved.
1>C:\Users\Sergey\AppData\Local\Syncfusion\EssentialStudio\14.2.0.28\MVC\ASP.NET Core Samples\Web\samplebrowser\project.json(44,57): error NU1001: The dependency System.Collections.NonGeneric >= 4.0.1-rc2-24027 could not be resolved.
1>C:\Users\Sergey\AppData\Local\Syncfusion\EssentialStudio\14.2.0.28\MVC\ASP.NET Core Samples\Web\samplebrowser\project.json(10,64): error NU1001: The dependency System.Collections.Specialized >= 4.0.1 could not be resolved.
1>C:\Users\Sergey\AppData\Local\Syncfusion\EssentialStudio\14.2.0.28\MVC\ASP.NET Core Samples\Web\samplebrowser\project.json(11,39): error NU1001: The dependency System.Collections.Specialized >= 4.0.1 could not be resolved.
1>C:\Users\Sergey\AppData\Local\Syncfusion\EssentialStudio\14.2.0.28\MVC\ASP.NET Core Samples\Web\samplebrowser\project.json(43,63): error NU1001: The dependency System.Collections.Specialized >= 4.0.1 could not be resolved.
1>C:\Users\Sergey\AppData\Local\Syncfusion\EssentialStudio\14.2.0.28\MVC\ASP.NET Core Samples\Web\samplebrowser\project.json(48,57): error NU1001: The dependency System.Collections.Specialized >= 4.0.1 could not be resolved.
1>C:\Users\Sergey\AppData\Local\Syncfusion\EssentialStudio\14.2.0.28\MVC\ASP.NET Core Samples\Web\samplebrowser\project.json(50,54): error NU1001: The dependency System.Collections.Specialized >= 4.0.1 could not be resolved.
1>C:\Users\Sergey\AppData\Local\Syncfusion\EssentialStudio\14.2.0.28\MVC\ASP.NET Core Samples\Web\samplebrowser\project.json(46,63): error NU1001: The dependency System.Collections.Specialized >= 4.0.1 could not be resolved.
1>C:\Users\Sergey\AppData\Local\Syncfusion\EssentialStudio\14.2.0.28\MVC\ASP.NET Core Samples\Web\samplebrowser\project.json(47,64): error NU1001: The dependency System.Collections.Specialized >= 4.0.1 could not be resolved.
1>C:\Users\Sergey\AppData\Local\Syncfusion\EssentialStudio\14.2.0.28\MVC\ASP.NET Core Samples\Web\samplebrowser\project.json(45,55): error NU1001: The dependency System.Collections.Specialized >= 4.0.1 could not be resolved.
1>C:\Users\Sergey\AppData\Local\Syncfusion\EssentialStudio\14.2.0.28\MVC\ASP.NET Core Samples\Web\samplebrowser\project.json(49,57): error NU1001: The dependency System.Collections.Specialized >= 4.0.1 could not be resolved.
1>C:\Users\Sergey\AppData\Local\Syncfusion\EssentialStudio\14.2.0.28\MVC\ASP.NET Core Samples\Web\samplebrowser\project.json(41,50): error NU1001: The dependency System.Collections.Specialized >= 4.0.1 could not be resolved.
1>C:\Users\Sergey\AppData\Local\Syncfusion\EssentialStudio\14.2.0.28\MVC\ASP.NET Core Samples\Web\samplebrowser\project.json(42,54): error NU1001: The dependency System.Collections.Specialized >= 4.0.1 could not be resolved.
1>C:\Users\Sergey\AppData\Local\Syncfusion\EssentialStudio\14.2.0.28\MVC\ASP.NET Core Samples\Web\samplebrowser\project.json(44,57): error NU1001: The dependency System.Collections.Specialized >= 4.0.1 could not be resolved.
1>C:\Users\Sergey\AppData\Local\Syncfusion\EssentialStudio\14.2.0.28\MVC\ASP.NET Core Samples\Web\samplebrowser\project.json(9,67): error NU1001: The dependency System.Data.Common >= 4.1.0 could not be resolved.
1>C:\Users\Sergey\AppData\Local\Syncfusion\EssentialStudio\14.2.0.28\MVC\ASP.NET Core Samples\Web\samplebrowser\project.json(10,64): error NU1001: The dependency System.Data.Common >= 4.1.0 could not be resolved.
1>C:\Users\Sergey\AppData\Local\Syncfusion\EssentialStudio\14.2.0.28\MVC\ASP.NET Core Samples\Web\samplebrowser\project.json(21,44): error NU1001: The dependency System.Data.Common >= 4.1.0 could not be resolved.
1>C:\Users\Sergey\AppData\Local\Syncfusion\EssentialStudio\14.2.0.28\MVC\ASP.NET Core Samples\Web\samplebrowser\project.json(19,54): error NU1001: The dependency System.Data.Common >= 4.1.0 could not be resolved.
1>C:\Users\Sergey\AppData\Local\Syncfusion\EssentialStudio\14.2.0.28\MVC\ASP.NET Core Samples\Web\samplebrowser\project.json(32,56): error NU1001: The dependency System.Data.Common >= 4.1.0 could not be resolved.
1>C:\Users\Sergey\AppData\Local\Syncfusion\EssentialStudio\14.2.0.28\MVC\ASP.NET Core Samples\Web\samplebrowser\project.json(36,54): error NU1001: The dependency System.Data.Common >= 4.1.0 could not be resolved.
1>C:\Users\Sergey\AppData\Local\Syncfusion\EssentialStudio\14.2.0.28\MVC\ASP.NET Core Samples\Web\samplebrowser\project.json(43,63): error NU1001: The dependency System.Data.Common >= 4.1.0 could not be resolved.
1>C:\Users\Sergey\AppData\Local\Syncfusion\EssentialStudio\14.2.0.28\MVC\ASP.NET Core Samples\Web\samplebrowser\project.json(48,57): error NU1001: The dependency System.Data.Common >= 4.1.0 could not be resolved.
1>C:\Users\Sergey\AppData\Local\Syncfusion\EssentialStudio\14.2.0.28\MVC\ASP.NET Core Samples\Web\samplebrowser\project.json(50,54): error NU1001: The dependency System.Data.Common >= 4.1.0 could not be resolved.
1>C:\Users\Sergey\AppData\Local\Syncfusion\EssentialStudio\14.2.0.28\MVC\ASP.NET Core Samples\Web\samplebrowser\project.json(46,63): error NU1001: The dependency System.Data.Common >= 4.1.0 could not be resolved.
1>C:\Users\Sergey\AppData\Local\Syncfusion\EssentialStudio\14.2.0.28\MVC\ASP.NET Core Samples\Web\samplebrowser\project.json(47,64): error NU1001: The dependency System.Data.Common >= 4.1.0 could not be resolved.
1>C:\Users\Sergey\AppData\Local\Syncfusion\EssentialStudio\14.2.0.28\MVC\ASP.NET Core Samples\Web\samplebrowser\project.json(45,55): error NU1001: The dependency System.Data.Common >= 4.1.0 could not be resolved.
1>C:\Users\Sergey\AppData\Local\Syncfusion\EssentialStudio\14.2.0.28\MVC\ASP.NET Core Samples\Web\samplebrowser\project.json(49,57): error NU1001: The dependency System.Data.Common >= 4.1.0 could not be resolved.
1>C:\Users\Sergey\AppData\Local\Syncfusion\EssentialStudio\14.2.0.28\MVC\ASP.NET Core Samples\Web\samplebrowser\project.json(41,50): error NU1001: The dependency System.Data.Common >= 4.1.0 could not be resolved.
1>C:\Users\Sergey\AppData\Local\Syncfusion\EssentialStudio\14.2.0.28\MVC\ASP.NET Core Samples\Web\samplebrowser\project.json(42,54): error NU1001: The dependency System.Data.Common >= 4.1.0 could not be resolved.
1>C:\Users\Sergey\AppData\Local\Syncfusion\EssentialStudio\14.2.0.28\MVC\ASP.NET Core Samples\Web\samplebrowser\project.json(9,67): error NU1001: The dependency System.Data.Common >= 4.0.1-rc2-24027 could not be resolved.
1>C:\Users\Sergey\AppData\Local\Syncfusion\EssentialStudio\14.2.0.28\MVC\ASP.NET Core Samples\Web\samplebrowser\project.json(10,64): error NU1001: The dependency System.Data.Common >= 4.0.1-rc2-24027 could not be resolved.
1>C:\Users\Sergey\AppData\Local\Syncfusion\EssentialStudio\14.2.0.28\MVC\ASP.NET Core Samples\Web\samplebrowser\project.json(21,44): error NU1001: The dependency System.Data.Common >= 4.0.1-rc2-24027 could not be resolved.
1>C:\Users\Sergey\AppData\Local\Syncfusion\EssentialStudio\14.2.0.28\MVC\ASP.NET Core Samples\Web\samplebrowser\project.json(19,54): error NU1001: The dependency System.Data.Common >= 4.0.1-rc2-24027 could not be resolved.
1>C:\Users\Sergey\AppData\Local\Syncfusion\EssentialStudio\14.2.0.28\MVC\ASP.NET Core Samples\Web\samplebrowser\project.json(32,56): error NU1001: The dependency System.Data.Common >= 4.0.1-rc2-24027 could not be resolved.
1>C:\Users\Sergey\AppData\Local\Syncfusion\EssentialStudio\14.2.0.28\MVC\ASP.NET Core Samples\Web\samplebrowser\project.json(36,54): error NU1001: The dependency System.Data.Common >= 4.0.1-rc2-24027 could not be resolved.
1>C:\Users\Sergey\AppData\Local\Syncfusion\EssentialStudio\14.2.0.28\MVC\ASP.NET Core Samples\Web\samplebrowser\project.json(43,63): error NU1001: The dependency System.Data.Common >= 4.0.1-rc2-24027 could not be resolved.
1>C:\Users\Sergey\AppData\Local\Syncfusion\EssentialStudio\14.2.0.28\MVC\ASP.NET Core Samples\Web\samplebrowser\project.json(48,57): error NU1001: The dependency System.Data.Common >= 4.0.1-rc2-24027 could not be resolved.
1>C:\Users\Sergey\AppData\Local\Syncfusion\EssentialStudio\14.2.0.28\MVC\ASP.NET Core Samples\Web\samplebrowser\project.json(50,54): error NU1001: The dependency System.Data.Common >= 4.0.1-rc2-24027 could not be resolved.
1>C:\Users\Sergey\AppData\Local\Syncfusion\EssentialStudio\14.2.0.28\MVC\ASP.NET Core Samples\Web\samplebrowser\project.json(46,63): error NU1001: The dependency System.Data.Common >= 4.0.1-rc2-24027 could not be resolved.
1>C:\Users\Sergey\AppData\Local\Syncfusion\EssentialStudio\14.2.0.28\MVC\ASP.NET Core Samples\Web\samplebrowser\project.json(47,64): error NU1001: The dependency System.Data.Common >= 4.0.1-rc2-24027 could not be resolved.
1>C:\Users\Sergey\AppData\Local\Syncfusion\EssentialStudio\14.2.0.28\MVC\ASP.NET Core Samples\Web\samplebrowser\project.json(45,55): error NU1001: The dependency System.Data.Common >= 4.0.1-rc2-24027 could not be resolved.
1>C:\Users\Sergey\AppData\Local\Syncfusion\EssentialStudio\14.2.0.28\MVC\ASP.NET Core Samples\Web\samplebrowser\project.json(49,57): error NU1001: The dependency System.Data.Common >= 4.0.1-rc2-24027 could not be resolved.
1>C:\Users\Sergey\AppData\Local\Syncfusion\EssentialStudio\14.2.0.28\MVC\ASP.NET Core Samples\Web\samplebrowser\project.json(41,50): error NU1001: The dependency System.Data.Common >= 4.0.1-rc2-24027 could not be resolved.
1>C:\Users\Sergey\AppData\Local\Syncfusion\EssentialStudio\14.2.0.28\MVC\ASP.NET Core Samples\Web\samplebrowser\project.json(42,54): error NU1001: The dependency System.Data.Common >= 4.0.1-rc2-24027 could not be resolved.
1>C:\Users\Sergey\AppData\Local\Syncfusion\EssentialStudio\14.2.0.28\MVC\ASP.NET Core Samples\Web\samplebrowser\project.json(19,54): error NU1001: The dependency System.Data.SqlClient >= 4.1.0 could not be resolved.
1>C:\Users\Sergey\AppData\Local\Syncfusion\EssentialStudio\14.2.0.28\MVC\ASP.NET Core Samples\Web\samplebrowser\project.json(32,56): error NU1001: The dependency System.Data.SqlClient >= 4.1.0 could not be resolved.
1>C:\Users\Sergey\AppData\Local\Syncfusion\EssentialStudio\14.2.0.28\MVC\ASP.NET Core Samples\Web\samplebrowser\project.json(36,54): error NU1001: The dependency System.Data.SqlClient >= 4.1.0 could not be resolved.
1>C:\Users\Sergey\AppData\Local\Syncfusion\EssentialStudio\14.2.0.28\MVC\ASP.NET Core Samples\Web\samplebrowser\project.json(9,67): error NU1001: The dependency System.Interactive.Async >= 3.0.0 could not be resolved.
1>C:\Users\Sergey\AppData\Local\Syncfusion\EssentialStudio\14.2.0.28\MVC\ASP.NET Core Samples\Web\samplebrowser\project.json(10,64): error NU1001: The dependency System.Interactive.Async >= 3.0.0 could not be resolved.
1>C:\Users\Sergey\AppData\Local\Syncfusion\EssentialStudio\14.2.0.28\MVC\ASP.NET Core Samples\Web\samplebrowser\project.json(21,44): error NU1001: The dependency System.Interactive.Async >= 3.0.0 could not be resolved.
1>C:\Users\Sergey\AppData\Local\Syncfusion\EssentialStudio\14.2.0.28\MVC\ASP.NET Core Samples\Web\samplebrowser\project.json(19,54): error NU1001: The dependency System.Interactive.Async >= 3.0.0 could not be resolved.
1>C:\Users\Sergey\AppData\Local\Syncfusion\EssentialStudio\14.2.0.28\MVC\ASP.NET Core Samples\Web\samplebrowser\project.json(32,56): error NU1001: The dependency System.Interactive.Async >= 3.0.0 could not be resolved.
1>C:\Users\Sergey\AppData\Local\Syncfusion\EssentialStudio\14.2.0.28\MVC\ASP.NET Core Samples\Web\samplebrowser\project.json(36,54): error NU1001: The dependency System.Interactive.Async >= 3.0.0 could not be resolved.
1>C:\Users\Sergey\AppData\Local\Syncfusion\EssentialStudio\14.2.0.28\MVC\ASP.NET Core Samples\Web\samplebrowser\project.json(19,54): error NU1001: The dependency System.IO.Pipes >= 4.0.0 could not be resolved.
1>C:\Users\Sergey\AppData\Local\Syncfusion\EssentialStudio\14.2.0.28\MVC\ASP.NET Core Samples\Web\samplebrowser\project.json(32,56): error NU1001: The dependency System.IO.Pipes >= 4.0.0 could not be resolved.
1>C:\Users\Sergey\AppData\Local\Syncfusion\EssentialStudio\14.2.0.28\MVC\ASP.NET Core Samples\Web\samplebrowser\project.json(36,54): error NU1001: The dependency System.IO.Pipes >= 4.0.0 could not be resolved.
1>C:\Users\Sergey\AppData\Local\Syncfusion\EssentialStudio\14.2.0.28\MVC\ASP.NET Core Samples\Web\samplebrowser\project.json(17,50): error NU1001: The dependency System.Net.WebSockets >= 4.0.0 could not be resolved.
1>C:\Users\Sergey\AppData\Local\Syncfusion\EssentialStudio\14.2.0.28\MVC\ASP.NET Core Samples\Web\samplebrowser\project.json(32,56): error NU1001: The dependency System.Net.WebSockets >= 4.0.0 could not be resolved.
1>C:\Users\Sergey\AppData\Local\Syncfusion\EssentialStudio\14.2.0.28\MVC\ASP.NET Core Samples\Web\samplebrowser\project.json(36,54): error NU1001: The dependency System.Net.WebSockets >= 4.0.0 could not be resolved.
1>C:\Users\Sergey\AppData\Local\Syncfusion\EssentialStudio\14.2.0.28\MVC\ASP.NET Core Samples\Web\samplebrowser\project.json(43,63): error NU1001: The dependency System.Net.WebSockets >= 4.0.0 could not be resolved.
1>C:\Users\Sergey\AppData\Local\Syncfusion\EssentialStudio\14.2.0.28\MVC\ASP.NET Core Samples\Web\samplebrowser\project.json(48,57): error NU1001: The dependency System.Net.WebSockets >= 4.0.0 could not be resolved.
1>C:\Users\Sergey\AppData\Local\Syncfusion\EssentialStudio\14.2.0.28\MVC\ASP.NET Core Samples\Web\samplebrowser\project.json(50,54): error NU1001: The dependency System.Net.WebSockets >= 4.0.0 could not be resolved.
1>C:\Users\Sergey\AppData\Local\Syncfusion\EssentialStudio\14.2.0.28\MVC\ASP.NET Core Samples\Web\samplebrowser\project.json(46,63): error NU1001: The dependency System.Net.WebSockets >= 4.0.0 could not be resolved.
1>C:\Users\Sergey\AppData\Local\Syncfusion\EssentialStudio\14.2.0.28\MVC\ASP.NET Core Samples\Web\samplebrowser\project.json(47,64): error NU1001: The dependency System.Net.WebSockets >= 4.0.0 could not be resolved.
1>C:\Users\Sergey\AppData\Local\Syncfusion\EssentialStudio\14.2.0.28\MVC\ASP.NET Core Samples\Web\samplebrowser\project.json(45,55): error NU1001: The dependency System.Net.WebSockets >= 4.0.0 could not be resolved.
1>C:\Users\Sergey\AppData\Local\Syncfusion\EssentialStudio\14.2.0.28\MVC\ASP.NET Core Samples\Web\samplebrowser\project.json(49,57): error NU1001: The dependency System.Net.WebSockets >= 4.0.0 could not be resolved.
1>C:\Users\Sergey\AppData\Local\Syncfusion\EssentialStudio\14.2.0.28\MVC\ASP.NET Core Samples\Web\samplebrowser\project.json(41,50): error NU1001: The dependency System.Net.WebSockets >= 4.0.0 could not be resolved.
1>C:\Users\Sergey\AppData\Local\Syncfusion\EssentialStudio\14.2.0.28\MVC\ASP.NET Core Samples\Web\samplebrowser\project.json(42,54): error NU1001: The dependency System.Net.WebSockets >= 4.0.0 could not be resolved.
1>C:\Users\Sergey\AppData\Local\Syncfusion\EssentialStudio\14.2.0.28\MVC\ASP.NET Core Samples\Web\samplebrowser\project.json(11,39): error NU1001: The dependency System.Net.WebSockets >= 4.0.0 could not be resolved.
1>C:\Users\Sergey\AppData\Local\Syncfusion\EssentialStudio\14.2.0.28\MVC\ASP.NET Core Samples\Web\samplebrowser\project.json(7,58): error NU1001: The dependency System.Net.WebSockets >= 4.0.0 could not be resolved.
1>C:\Users\Sergey\AppData\Local\Syncfusion\EssentialStudio\14.2.0.28\MVC\ASP.NET Core Samples\Web\samplebrowser\project.json(10,64): error NU1001: The dependency System.Net.WebSockets >= 4.0.0 could not be resolved.
1>C:\Users\Sergey\AppData\Local\Syncfusion\EssentialStudio\14.2.0.28\MVC\ASP.NET Core Samples\Web\samplebrowser\project.json(40,43): error NU1001: The dependency System.Net.WebSockets >= 4.0.0 could not be resolved.
1>C:\Users\Sergey\AppData\Local\Syncfusion\EssentialStudio\14.2.0.28\MVC\ASP.NET Core Samples\Web\samplebrowser\project.json(8,46): error NU1001: The dependency System.Net.WebSockets >= 4.0.0 could not be resolved.
1>C:\Users\Sergey\AppData\Local\Syncfusion\EssentialStudio\14.2.0.28\MVC\ASP.NET Core Samples\Web\samplebrowser\project.json(44,57): error NU1001: The dependency System.Net.WebSockets >= 4.0.0 could not be resolved.
1>C:\Users\Sergey\AppData\Local\Syncfusion\EssentialStudio\14.2.0.28\MVC\ASP.NET Core Samples\Web\samplebrowser\project.json(16,57): error NU1001: The dependency System.Net.WebSockets >= 4.0.0 could not be resolved.
1>C:\Users\Sergey\AppData\Local\Syncfusion\EssentialStudio\14.2.0.28\MVC\ASP.NET Core Samples\Web\samplebrowser\project.json(18,47): error NU1001: The dependency System.Net.WebSockets >= 4.0.0 could not be resolved.
1>C:\Users\Sergey\AppData\Local\Syncfusion\EssentialStudio\14.2.0.28\MVC\ASP.NET Core Samples\Web\samplebrowser\project.json(21,44): error NU1001: The dependency System.Net.WebSockets >= 4.0.0 could not be resolved.
1>C:\Users\Sergey\AppData\Local\Syncfusion\EssentialStudio\14.2.0.28\MVC\ASP.NET Core Samples\Web\samplebrowser\project.json(9,67): error NU1001: The dependency System.Net.WebSockets >= 4.0.0 could not be resolved.
1>C:\Users\Sergey\AppData\Local\Syncfusion\EssentialStudio\14.2.0.28\MVC\ASP.NET Core Samples\Web\samplebrowser\project.json(31,61): error NU1001: The dependency System.Net.WebSockets >= 4.0.0 could not be resolved.
1>C:\Users\Sergey\AppData\Local\Syncfusion\EssentialStudio\14.2.0.28\MVC\ASP.NET Core Samples\Web\samplebrowser\project.json(44,57): error NU1001: The dependency System.Xml.XmlSerializer >= 4.0.11 could not be resolved.
1> Compilation failed.
1> 0 Warning(s)
1> 171 Error(s)
1> Time elapsed 00:00:00.1340911
========== Build: 0 succeeded, 1 failed, 0 up-to-date, 0 skipped ==========



Manikandan Mariappan [Syncfusion]
Replied On August 16, 2016 09:19 AM UTC

Hi Asaf,   
  
We have analyzed your issue report. We suspect that the issue caused from “NuGet Package Manager configuration” in your Visual Studio 2015 application.   
1.       If you fetch our Syncfusion Packages from online feed, then your packages manager configurations look as below screenshot.  
   
     
2.       Or else, if you have already installed our Essential Studio build on your local machine. Then the package manager need to configured only the ASP.NET Core packages related to online feed.   
 
 
Note: None other than online feed URL or local directory path are not exists or mentioned in the NuGet package Manager configuration window.   
3.       Once the above configuration has completed, please remove your project.lock.json file in your project directory.   
     
   
  
4.       Now all the packages will be restoring in your application without any issues.   
If still you have face any other issues or deployment problem after this configuration, please share the following details which will be more helpful at our end to provide the solution.   
1.       NuGet Package configuration window   
2.       During package restore time output window result.   
3.       project.json file (if you have did any modifications)   
4.       Application project references in your solution explorer with expanded mode.   
  
Regards,   
Manikandan Mariappan   


Sergey Seriakov
Replied On August 17, 2016 10:49 AM UTC

Guys, thanks a lot!

Now it works perfectly!

Manikandan Mariappan [Syncfusion]
Replied On August 18, 2016 09:22 AM UTC

Hi Asaf, 
  
We are glad to know that, the reported issue has been resolved at your end. 
  
Regards, 
Manikandan Manikandan 


CONFIRMATION

This post will be permanently deleted. Are you sure you want to continue?

Sorry, An error occured while processing your request. Please try again later.

Please sign in to access our forum

or the page will be automatically redirected to sign-in page in 10 seconds.

Warning Icon You are using an outdated version of Internet Explorer that may not display all features of this and other websites. Upgrade to Internet Explorer 8 or newer for a better experience.Close Icon

;